Target
Leucine-rich repeat serine/threonine-protein kinase 2 [G2019S]
Ligand
BDBM501980
Substrate
Meas. Tech.
Biochemical Assay
IC50
<30±n/a nM
Citation
 Estrada, AAFeng, JALyssikatos, JPSweeney, ZKde Vicente Fidalgo, J Substituted pyrimidines as LRKK2 inhibitors US Patent  US11028080 Publication Date 6/8/2021 
Target
Name:
Leucine-rich repeat serine/threonine-protein kinase 2 [G2019S]
Synonyms:
LRRK2 LRRK2_HUMAN Leucine-rich repeat serine/threonine-protein kinase 2 (LRRK2)(G2019S) PARK8
Type:
Mol. Mass.:
286143.23
Organism:
Homo sapiens (Human)
Description:
Q5S007(G2019S)
Residue:
2527
  
Inhibitor
Name:
BDBM501980
Synonyms:
US11028080, No. 36
Type:
Small organic molecule
Emp. Form.:
C13H12ClF3N6S
Mol. Mass.:
376.788
SMILES:
CNc1nc(Nc2sc(nc2Cl)C(C)(C)C#N)ncc1C(F)(F)F
: