Target
Protein arginine N-methyltransferase 1
Ligand
BDBM502008
Substrate
Meas. Tech.
PRMT1 Enzymatic Assay
IC50
48.0±n/a nM
Citation
 Di Francesco, MEJones, PMcAfoos, TJ Ethanediamine-heterocycle derivatives as inhibitors of protein arginine methyltransferases US Patent  US11028083 Publication Date 6/8/2021 
Target
Name:
Protein arginine N-methyltransferase 1
Synonyms:
2.1.1.319 HMT2 HRMT1L2 {ECO:0000303|PubMed:11097842 IR1B4 PRMT1 Protein-arginine N-methyltransferase 1 | Synonyms=HMT2
Type:
PROTEIN
Mol. Mass.:
42451.61
Organism:
Homo sapiens
Description:
ChEMBL_100878
Residue:
371
  
Inhibitor
Name:
BDBM502008
Synonyms:
US11028083, Example 5a
Type:
Small organic molecule
Emp. Form.:
C22H38F2N4O
Mol. Mass.:
412.5601
SMILES:
CCOCC1(CC)CC[C@@H](CC1)c1c(CN(C)CCNC)nn2CC(F)(F)Cc12
: