Target
Protein arginine N-methyltransferase 1
Ligand
BDBM502028
Substrate
Meas. Tech.
PRMT1 Enzymatic Assay
IC50
44.0±n/a nM
Citation
 Di Francesco, MEJones, PMcAfoos, TJ Ethanediamine-heterocycle derivatives as inhibitors of protein arginine methyltransferases US Patent  US11028083 Publication Date 6/8/2021 
Target
Name:
Protein arginine N-methyltransferase 1
Synonyms:
2.1.1.319 HMT2 HRMT1L2 {ECO:0000303|PubMed:11097842 IR1B4 PRMT1 Protein-arginine N-methyltransferase 1 | Synonyms=HMT2
Type:
PROTEIN
Mol. Mass.:
42451.61
Organism:
Homo sapiens
Description:
ChEMBL_100878
Residue:
371
  
Inhibitor
Name:
BDBM502028
Synonyms:
N1-((3-cyclohexyl-6,7- dihydro-4H-pyrazolo- [5,1-c][1,4]oxazin-2- yl)methyl)-N1,N2- dimethylethane-1,2- diamine | US11028083, Example 22
Type:
Small organic molecule
Emp. Form.:
C17H30N4O
Mol. Mass.:
306.4463
SMILES:
CNCCN(C)Cc1nn2CCOCc2c1C1CCCCC1
: