Target
Protein arginine N-methyltransferase 1
Ligand
BDBM502054
Substrate
Meas. Tech.
PRMT1 Enzymatic Assay
IC50
176±n/a nM
Citation
 Di Francesco, MEJones, PMcAfoos, TJ Ethanediamine-heterocycle derivatives as inhibitors of protein arginine methyltransferases US Patent  US11028083 Publication Date 6/8/2021 
Target
Name:
Protein arginine N-methyltransferase 1
Synonyms:
2.1.1.319 HMT2 HRMT1L2 {ECO:0000303|PubMed:11097842 IR1B4 PRMT1 Protein-arginine N-methyltransferase 1 | Synonyms=HMT2
Type:
PROTEIN
Mol. Mass.:
42451.61
Organism:
Homo sapiens
Description:
ChEMBL_100878
Residue:
371
  
Inhibitor
Name:
BDBM502054
Synonyms:
1-Methyl-8-(2- ((methyl(2-(methyl- amino)ethyl)amino)- methyl)-5,6-dihydro- 4H-pyrrolo[1,2-b]- pyrazol-3-yl)-1-aza- spiro[4.5]decan-2-one | US11028083, Example 48
Type:
Small organic molecule
Emp. Form.:
C21H35N5O
Mol. Mass.:
373.5355
SMILES:
CNCCN(C)Cc1nn2CCCc2c1C1CCC2(CCC(=O)N2C)CC1
: