Target
Protein arginine N-methyltransferase 1
Ligand
BDBM502059
Substrate
Meas. Tech.
PRMT1 Enzymatic Assay
IC50
317±n/a nM
Citation
 Di Francesco, MEJones, PMcAfoos, TJ Ethanediamine-heterocycle derivatives as inhibitors of protein arginine methyltransferases US Patent  US11028083 Publication Date 6/8/2021 
Target
Name:
Protein arginine N-methyltransferase 1
Synonyms:
2.1.1.319 HMT2 HRMT1L2 {ECO:0000303|PubMed:11097842 IR1B4 PRMT1 Protein-arginine N-methyltransferase 1 | Synonyms=HMT2
Type:
PROTEIN
Mol. Mass.:
42451.61
Organism:
Homo sapiens
Description:
ChEMBL_100878
Residue:
371
  
Inhibitor
Name:
BDBM502059
Synonyms:
N-(3-(2-((methyl(2- (methylamino)ethyl)- amino)methyl)-5,6- dihydro-4H-pyrrolo- [1,2-b]pyrazol-3-yl)- cyclopentyl)ethane- sulfonamide | US11028083, Example 53
Type:
Small organic molecule
Emp. Form.:
C18H33N5O2S
Mol. Mass.:
383.552
SMILES:
CCS(=O)(=O)NC1CCC(C1)c1c(CN(C)CCNC)nn2CCCc12
: