Target
Protein arginine N-methyltransferase 1
Ligand
BDBM502115
Substrate
Meas. Tech.
PRMT1 Enzymatic Assay
IC50
40.0±n/a nM
Citation
 Di Francesco, MEJones, PMcAfoos, TJ Ethanediamine-heterocycle derivatives as inhibitors of protein arginine methyltransferases US Patent  US11028083 Publication Date 6/8/2021 
Target
Name:
Protein arginine N-methyltransferase 1
Synonyms:
2.1.1.319 HMT2 HRMT1L2 {ECO:0000303|PubMed:11097842 IR1B4 PRMT1 Protein-arginine N-methyltransferase 1 | Synonyms=HMT2
Type:
PROTEIN
Mol. Mass.:
42451.61
Organism:
Homo sapiens
Description:
ChEMBL_100878
Residue:
371
  
Inhibitor
Name:
BDBM502115
Synonyms:
US11028083, Example 87a
Type:
Small organic molecule
Emp. Form.:
C23H38F2N4O
Mol. Mass.:
424.5708
SMILES:
CNCCN(C)Cc1nn2CC(F)(F)Cc2c1[C@H]1CC[C@]2(CC1)COCC(C)(C)C2
: