Target
Protein arginine N-methyltransferase 6
Ligand
BDBM502017
Substrate
Meas. Tech.
RapidFire Mass Spectrometry Selectivity Assay
IC50
99.0±n/a nM
Citation
 Di Francesco, MEJones, PMcAfoos, TJ Ethanediamine-heterocycle derivatives as inhibitors of protein arginine methyltransferases US Patent  US11028083 Publication Date 6/8/2021 
Target
Name:
Protein arginine N-methyltransferase 6
Synonyms:
ANM6_HUMAN Heterogeneous nuclear ribonucleoprotein methyltransferase-like protein 6 PRMT6 | Protein arginine methyltransferase 6 (PRMT6)
Type:
Protein
Mol. Mass.:
41928.48
Organism:
Homo sapiens (Human)
Description:
Residue:
375
  
Inhibitor
Name:
BDBM502017
Synonyms:
N1-((3-cyclohexyl-5,6- dihydro-4H-pyrrolo- [1,2-b]pyrazol-2-yl)- methyl)-N1,N2- dimethylethane-1,2- diamine | US11028083, Example 11
Type:
Small organic molecule
Emp. Form.:
C17H30N4
Mol. Mass.:
290.4469
SMILES:
CNCCN(C)Cc1nn2CCCc2c1C1CCCCC1
: