Target
Mitogen-activated protein kinase kinase kinase kinase 1
Ligand
BDBM500439
Substrate
Meas. Tech.
Biochemical Enzyme Assay
IC50
<100±n/a nM
Citation
 Kaila, NLinney, IWard, SWishart, GWhittaker, BCote, AGreenwood, JRLeffler, AAlbanese, SKSeverance, DL Substituted isoindolin-1-ones and 2,3-dihydro-1h-pyrrolo[3,4-c]pyridin-1-ones as hpk1 antagonists US Patent  US11028085 Publication Date 6/8/2021 
Target
Name:
Mitogen-activated protein kinase kinase kinase kinase 1
Synonyms:
HPK1 MAP4K1
Type:
PROTEIN
Mol. Mass.:
91316.07
Organism:
Homo sapiens (Human)
Description:
ChEMBL_586597
Residue:
833
  
Inhibitor
Name:
BDBM500439
Synonyms:
4-0,3-dimethylpyrrolo [2,3-b]pyridin-4- yl)-7-[(5- piperazin-1-yl- 2-pyridyl)amino] isoindolin-1-one US11078201, Compound I-98
Type:
Small organic molecule
Emp. Form.:
C26H27N7O
Mol. Mass.:
453.5389
SMILES:
Cc1cn(C)c2nccc(-c3ccc(Nc4ccc(cn4)N4CCNCC4)c4C(=O)NCc34)c12
: