Target
Mitogen-activated protein kinase kinase kinase kinase 1
Ligand
BDBM502291
Substrate
Meas. Tech.
Biochemical Enzyme Assay
IC50
<100±n/a nM
Citation
 Kaila, NLinney, IWard, SWishart, GWhittaker, BCote, AGreenwood, JRLeffler, AAlbanese, SKSeverance, DL Substituted isoindolin-1-ones and 2,3-dihydro-1h-pyrrolo[3,4-c]pyridin-1-ones as hpk1 antagonists US Patent  US11028085 Publication Date 6/8/2021 
Target
Name:
Mitogen-activated protein kinase kinase kinase kinase 1
Synonyms:
HPK1 MAP4K1
Type:
PROTEIN
Mol. Mass.:
91316.07
Organism:
Homo sapiens (Human)
Description:
ChEMBL_586597
Residue:
833
  
Inhibitor
Name:
BDBM502291
Synonyms:
US11028085, Compound I-144 US11548890, Compound I-144
Type:
Small organic molecule
Emp. Form.:
C25H25N7O2
Mol. Mass.:
455.5117
SMILES:
Cn1ccc2c(ncnc12)-c1ccc(Nc2ccc(cn2)N2CCC(O)CC2)c2C(=O)NCc12
: