Target
Mitogen-activated protein kinase kinase kinase kinase 1
Ligand
BDBM500921
Substrate
Meas. Tech.
Biochemical Enzyme Assay
IC50
<100±n/a nM
Citation
 Kaila, NLinney, IWard, SWishart, GWhittaker, BCote, AGreenwood, JRLeffler, AAlbanese, SKSeverance, DL Substituted isoindolin-1-ones and 2,3-dihydro-1h-pyrrolo[3,4-c]pyridin-1-ones as hpk1 antagonists US Patent  US11028085 Publication Date 6/8/2021 
Target
Name:
Mitogen-activated protein kinase kinase kinase kinase 1
Synonyms:
HPK1 MAP4K1
Type:
PROTEIN
Mol. Mass.:
91316.07
Organism:
Homo sapiens (Human)
Description:
ChEMBL_586597
Residue:
833
  
Inhibitor
Name:
BDBM500921
Synonyms:
(R)-7-((5-(2- ((dimethylamino)- methyl)mor- pholino)pyridin- 2-yl)amino)- 4-(1-methyl- 1H-pyrrolo[2,3- b]pyridin-4-yl)-2,3- dihydro-1H- pyrrolo[3,4- c]pyridin-1-one US11078201, Compound I-585 | US11548890, Compound I-585
Type:
Small organic molecule
Emp. Form.:
C27H30N8O2
Mol. Mass.:
498.5795
SMILES:
CN(C)C[C@@H]1CN(CCO1)c1ccc(Nc2cnc(c3CNC(=O)c23)-c2ccnc3n(C)ccc23)nc1
: