Target
Mitogen-activated protein kinase kinase kinase kinase 1
Ligand
BDBM500980
Substrate
Meas. Tech.
Biochemical Enzyme Assay
IC50
<100±n/a nM
Citation
 Kaila, NLinney, IWard, SWishart, GWhittaker, BCote, AGreenwood, JRLeffler, AAlbanese, SKSeverance, DL Substituted isoindolin-1-ones and 2,3-dihydro-1h-pyrrolo[3,4-c]pyridin-1-ones as hpk1 antagonists US Patent  US11028085 Publication Date 6/8/2021 
Target
Name:
Mitogen-activated protein kinase kinase kinase kinase 1
Synonyms:
HPK1 MAP4K1
Type:
PROTEIN
Mol. Mass.:
91316.07
Organism:
Homo sapiens (Human)
Description:
ChEMBL_586597
Residue:
833
  
Inhibitor
Name:
BDBM500980
Synonyms:
(R)-7-((5-(2- (methylmeth- yl)morpho- lino)pyridin-2- yl)amino)-4- (7-methyl-7]-4- pyrrolo[2,3- d]pyrimidin-4- yl)isoindolin- 1-one US11078201, Compound I-649 | US11548890, Compound I-649
Type:
Small organic molecule
Emp. Form.:
C26H27N7O3
Mol. Mass.:
485.5377
SMILES:
COC[C@@H]1CN(CCO1)c1ccc(Nc2ccc(c3CNC(=O)c23)-c2ncnc3n(C)ccc23)nc1
: