Target
Bromodomain-containing protein 4
Ligand
BDBM502290
Substrate
Meas. Tech.
Evaluation of BRD4 binding inhibition ability
IC50
2.00±n/a nM
Citation
 Lee, KChoi, GAli, ILee, JYLee, JSPark, WJKim, YTKim, SHKim, JHLim, J [1,2,4]Triazolo[4,3-a]quinoxaline derivative, method for preparing same, and pharmaceutical composition for preventing or treating BET protein-related diseases, containing same as active ingredient US Patent  US11028090 Publication Date 6/8/2021 
Target
Name:
Bromodomain-containing protein 4
Synonyms:
BRD4 Bromodomain-containing protein 4 (BRD4) Protein HUNK1
Type:
Protein
Mol. Mass.:
152264.84
Organism:
Homo sapiens (Human)
Description:
O60885
Residue:
1362
  
Inhibitor
Name:
BDBM502290
Synonyms:
US11028090, Example 176 | [4-(7,8- diethoxy-1- methyl- [1,2,4]triazolo [4,3-a] quinoxaline-4- ylamino)- butyl]- carbamic acid isobutylester
Type:
Small organic molecule
Emp. Form.:
C23H34N6O4
Mol. Mass.:
458.5539
SMILES:
CCOc1cc2nc(NCCCCNC(=O)OCC(C)C)c3nnc(C)n3c2cc1OCC
: