Target
Bromodomain-containing protein 4
Ligand
BDBM502417
Substrate
Meas. Tech.
Evaluation of BRD4 binding inhibition ability
IC50
7.00±n/a nM
Citation
 Lee, KChoi, GAli, ILee, JYLee, JSPark, WJKim, YTKim, SHKim, JHLim, J [1,2,4]Triazolo[4,3-a]quinoxaline derivative, method for preparing same, and pharmaceutical composition for preventing or treating BET protein-related diseases, containing same as active ingredient US Patent  US11028090 Publication Date 6/8/2021 
Target
Name:
Bromodomain-containing protein 4
Synonyms:
BRD4 Bromodomain-containing protein 4 (BRD4) Protein HUNK1
Type:
Protein
Mol. Mass.:
152264.84
Organism:
Homo sapiens (Human)
Description:
O60885
Residue:
1362
  
Inhibitor
Name:
BDBM502417
Synonyms:
2-(S)-(2- (S)-hydroxy- propionylami- no)-N-[4-(7- methoxy-1- methyl- [1,2,4]tri- azolo[4,3- a]quinoxaline- 4-ylamino)- | US11028090, Example 324
Type:
Small organic molecule
Emp. Form.:
C23H35N7O4
Mol. Mass.:
473.5685
SMILES:
COc1ccc(c(c1)\N=C\NCCCCNC(=O)[C@@H](NC(=O)[C@H](C)O)C(C)C)-n1cnnc1C
: