Target
High affinity cGMP-specific 3',5'-cyclic phosphodiesterase 9A
Ligand
BDBM484505
Substrate
Meas. Tech.
Enzyme Assay
Ki
0.500±n/a nM
Citation
 Arasappan, ACox, JMDebenham, JSHussain, ZLi, DMeng, DRaghavan, S Substituted pyrazolo[3,4-d]pyrimidines as PDE9 inhibitors US Patent  US11028092 Publication Date 6/8/2021 
Target
Name:
High affinity cGMP-specific 3',5'-cyclic phosphodiesterase 9A
Synonyms:
3',5'-cyclic phosphodiesterase PDE9A_HUMAN Phosphodiesterase 9A (PDE9) | Phosphodiesterase 9A (PDE9A)
Type:
Protein
Mol. Mass.:
68488.40
Organism:
Homo sapiens (Human)
Description:
O76083
Residue:
593
  
Inhibitor
Name:
BDBM484505
Synonyms:
US10934294, Example 27 US10934294, Example 29 US11028092, Example 30
Type:
Small organic molecule
Emp. Form.:
C21H16F3N9O
Mol. Mass.:
467.4066
SMILES:
CC(c1cnc(cn1)C(F)(F)F)n1nc(C#N)c2c1nc([nH]c2=O)C1CCC1c1ncccn1
: