Target
High affinity cGMP-specific 3',5'-cyclic phosphodiesterase 9A
Ligand
BDBM484517
Substrate
Meas. Tech.
Enzyme Assay
Ki
>608±n/a nM
Citation
 Arasappan, ACox, JMDebenham, JSHussain, ZLi, DMeng, DRaghavan, S Substituted pyrazolo[3,4-d]pyrimidines as PDE9 inhibitors US Patent  US11028092 Publication Date 6/8/2021 
Target
Name:
High affinity cGMP-specific 3',5'-cyclic phosphodiesterase 9A
Synonyms:
3',5'-cyclic phosphodiesterase PDE9A_HUMAN Phosphodiesterase 9A (PDE9) | Phosphodiesterase 9A (PDE9A)
Type:
Protein
Mol. Mass.:
68488.40
Organism:
Homo sapiens (Human)
Description:
O76083
Residue:
593
  
Inhibitor
Name:
BDBM484517
Synonyms:
US10934294, Example 38 US10934294, Example 40 US10934294, Example 42 US10934294, Example 44 US11028092, Example 45
Type:
Small organic molecule
Emp. Form.:
C22H18F2N8O
Mol. Mass.:
448.4281
SMILES:
CC(c1ccc(nc1)C(F)F)n1nc(C#N)c2c1nc([nH]c2=O)C1CCC1c1ncccn1
: