Target
High affinity cGMP-specific 3',5'-cyclic phosphodiesterase 9A
Ligand
BDBM484529
Substrate
Meas. Tech.
Enzyme Assay
Ki
493±n/a nM
Citation
 Arasappan, ACox, JMDebenham, JSHussain, ZLi, DMeng, DRaghavan, S Substituted pyrazolo[3,4-d]pyrimidines as PDE9 inhibitors US Patent  US11028092 Publication Date 6/8/2021 
Target
Name:
High affinity cGMP-specific 3',5'-cyclic phosphodiesterase 9A
Synonyms:
3',5'-cyclic phosphodiesterase PDE9A_HUMAN Phosphodiesterase 9A (PDE9) | Phosphodiesterase 9A (PDE9A)
Type:
Protein
Mol. Mass.:
68488.40
Organism:
Homo sapiens (Human)
Description:
O76083
Residue:
593
  
Inhibitor
Name:
BDBM484529
Synonyms:
US10934294, Example 50 US10934294, Example 52 US10934294, Example 54 US10934294, Example 56 US11028092, Example 57
Type:
Small organic molecule
Emp. Form.:
C24H22N8O
Mol. Mass.:
438.4845
SMILES:
CC(c1ccc(nc1)C1CC1)n1nc(C#N)c2c1nc([nH]c2=O)C1CCC1c1ncccn1
: