Target
High affinity cGMP-specific 3',5'-cyclic phosphodiesterase 9A
Ligand
BDBM484591
Substrate
Meas. Tech.
Enzyme Assay
Ki
0.050±n/a nM
Citation
 Arasappan, ACox, JMDebenham, JSHussain, ZLi, DMeng, DRaghavan, S Substituted pyrazolo[3,4-d]pyrimidines as PDE9 inhibitors US Patent  US11028092 Publication Date 6/8/2021 
Target
Name:
High affinity cGMP-specific 3',5'-cyclic phosphodiesterase 9A
Synonyms:
3',5'-cyclic phosphodiesterase PDE9A_HUMAN Phosphodiesterase 9A (PDE9) | Phosphodiesterase 9A (PDE9A)
Type:
Protein
Mol. Mass.:
68488.40
Organism:
Homo sapiens (Human)
Description:
O76083
Residue:
593
  
Inhibitor
Name:
BDBM484591
Synonyms:
US10934294, Example 110 | US11028092, Example 110
Type:
Small organic molecule
Emp. Form.:
C23H19F3N8O
Mol. Mass.:
480.4452
SMILES:
C[C@@H](c1ccc(nc1)C(F)(F)F)n1nc(C#N)c2c1nc([nH]c2=O)[C@H]1CC[C@@H]1c1nccc(C)n1
: