Target
Non-receptor tyrosine-protein kinase TYK2
Ligand
BDBM325374
Substrate
Meas. Tech.
Tyk2 Inhibition Assay
IC50
<10±n/a nM
Citation
 Allen, SBoys, MLChicarelli, MJFell, JBFischer, JPGaudino, JHicken, EJHinklin, RJKraser, CFLaird, ERobinson, JETang, TPBurgess, LERieger, RAPheneger, JSatoh, YLeftheris, KRaheja, RKBennett, BL 4,6-substituted-pyrazolo[1,5-a]pyrazines as janus kinase inhibitors US Patent  US11028093 Publication Date 6/8/2021 
Target
Name:
Non-receptor tyrosine-protein kinase TYK2
Synonyms:
Non-receptor tyrosine-protein kinase TYK2 (TYK2) TYK2_HUMAN | Tyrosine-protein kinase TYK2
Type:
Protein
Mol. Mass.:
133666.03
Organism:
Homo sapiens (Human)
Description:
P29597
Residue:
1187
  
Inhibitor
Name:
BDBM325374
Synonyms:
2-amino-1-(4-(4-(4-(1-(pentan-3-yl)-1H-pyrazol-4-yl)pyrazolo[1,5-a]pyrazin-6-yl)-1H-pyrazol-1-yl)piperidin-1-yl)ethanone US10730880, Example 36 | US11028093, Example 36
Type:
Small organic molecule
Emp. Form.:
C24H31N9O
Mol. Mass.:
461.5626
SMILES:
CCC(CC)n1cc(cn1)-c1nc(cn2nccc12)-c1cnn(c1)C1CCN(CC1)C(=O)CN
: