Target
Tyrosine-protein kinase JAK2
Ligand
BDBM325516
Substrate
Meas. Tech.
JAK2 Inhibition Assay
IC50
55±n/a nM
Citation
 Allen, SBoys, MLChicarelli, MJFell, JBFischer, JPGaudino, JHicken, EJHinklin, RJKraser, CFLaird, ERobinson, JETang, TPBurgess, LERieger, RAPheneger, JSatoh, YLeftheris, KRaheja, RKBennett, BL 4,6-substituted-pyrazolo[1,5-a]pyrazines as janus kinase inhibitors US Patent  US11028093 Publication Date 6/8/2021 
Target
Name:
Tyrosine-protein kinase JAK2
Synonyms:
JAK-2 JAK2_HUMAN Janus kinase 2 (JAK2) | Janus kinase 2 (a protein tyrosine kinase)
Type:
Protein
Mol. Mass.:
130684.68
Organism:
Homo sapiens (Human)
Description:
O60674
Residue:
1132
  
Inhibitor
Name:
BDBM325516
Synonyms:
(cis-3- hydroxycyclobutyl)(3- (4-(4-(1-(pentan-3-yl)- 1H-pyrazol-4- yl)pyrazolo[1,5- a]pyrazin-6-yl)-1H- pyrazol-1-yl)azetidin-1- yl)methanone US10730880, Example 179 | US11028093, Example 179
Type:
Small organic molecule
Emp. Form.:
C25H30N8O2
Mol. Mass.:
474.5581
SMILES:
CCC(CC)n1cc(cn1)-c1nc(cn2nccc12)-c1cnn(c1)C1CN(C1)C(=O)C1C[C@H](O)C1
: