Target
Protein arginine N-methyltransferase 5
Ligand
BDBM425114
Substrate
Meas. Tech.
Biochemical Assay
IC50
19.0±n/a nM
Citation
 Stupple, PA 3-oxa-8-azabicyclo[3.2.1]octane derivatives and their use in the treatment of cancer and hemoglobinopathies US Patent  US11028101 Publication Date 6/8/2021 
Target
Name:
Protein arginine N-methyltransferase 5
Synonyms:
72 kDa ICln-binding protein HRMT1L5 IBP72 Jak-binding protein 1 PRMT5/MEP50 complex Protein arginine methyltransferase 5 (PRMT5) SKB1 homolog Shk1 kinase-binding protein 1 homolog
Type:
Enzyme
Mol. Mass.:
72679.99
Organism:
Homo sapiens (Human)
Description:
O14744
Residue:
637
  
Inhibitor
Name:
BDBM425114
Synonyms:
US10519167, Compound 2 | US11028101, Compound 2
Type:
Small organic molecule
Emp. Form.:
C29H37N3O6
Mol. Mass.:
523.6206
SMILES:
CCOc1cc(ccc1C(=O)NC[C@@H](O)CNC1Cc2ccccc2C1)C(=O)N1C2COCC1CC(O)C2
: