Target
Tryptophan 5-hydroxylase 1
Ligand
BDBM445668
Substrate
Meas. Tech.
In Vitro Enzyme Activity Assay
IC50
7827±822 nM
Citation
 Bader, MSpecker, EMatthes, SSchütz, AMallow, KGrohmann, MNazaré, M Xanthine derivatives, their use as a medicament, and pharmaceutical preparations comprising the same US Patent  US11028104 Publication Date 6/8/2021 
Target
Name:
Tryptophan 5-hydroxylase 1
Synonyms:
TPH TPH1_HUMAN TRPH | Tryptophan 5-monooxygenase 1
Type:
PROTEIN
Mol. Mass.:
50990.64
Organism:
Homo sapiens (Human)
Description:
ChEMBL_1361824
Residue:
444
  
Inhibitor
Name:
BDBM445668
Synonyms:
Ex. 6/KM-06-80/(I-6) US11028104, Example 6
Type:
Small organic molecule
Emp. Form.:
C23H20N6O4
Mol. Mass.:
444.4427
SMILES:
CCn1c2nc(Cc3cn4ccccc4n3)n(Cc3ccc(cc3)C(O)=O)c2c(=O)[nH]c1=O
: