Target
Tryptophan 5-hydroxylase 1
Ligand
BDBM502700
Substrate
Meas. Tech.
In Vitro Enzyme Activity Assay
IC50
940±179 nM
Citation
 Bader, MSpecker, EMatthes, SSchütz, AMallow, KGrohmann, MNazaré, M Xanthine derivatives, their use as a medicament, and pharmaceutical preparations comprising the same US Patent  US11028104 Publication Date 6/8/2021 
Target
Name:
Tryptophan 5-hydroxylase 1
Synonyms:
TPH TPH1_HUMAN TRPH | Tryptophan 5-monooxygenase 1
Type:
PROTEIN
Mol. Mass.:
50990.64
Organism:
Homo sapiens (Human)
Description:
ChEMBL_1361824
Residue:
444
  
Inhibitor
Name:
BDBM502700
Synonyms:
KM-06-91 | US11028104, Example 11
Type:
Small organic molecule
Emp. Form.:
C28H22F3N7O2
Mol. Mass.:
545.5152
SMILES:
CCn1c2nc(Cc3cn4ccccc4n3)n(Cc3ccc(cc3)-c3ccc(cn3)C(F)(F)F)c2c(=O)[nH]c1=O
: