Target
Tryptophan 5-hydroxylase 1
Ligand
BDBM445688
Substrate
Meas. Tech.
In Vitro Enzyme Activity Assay
IC50
133600±45540 nM
Citation
 Bader, MSpecker, EMatthes, SSchütz, AMallow, KGrohmann, MNazaré, M Xanthine derivatives, their use as a medicament, and pharmaceutical preparations comprising the same US Patent  US11028104 Publication Date 6/8/2021 
Target
Name:
Tryptophan 5-hydroxylase 1
Synonyms:
TPH TPH1_HUMAN TRPH | Tryptophan 5-monooxygenase 1
Type:
PROTEIN
Mol. Mass.:
50990.64
Organism:
Homo sapiens (Human)
Description:
ChEMBL_1361824
Residue:
444
  
Inhibitor
Name:
BDBM445688
Synonyms:
Ex. 24/KM-06-112/(I-24) US11028104, Example 24
Type:
Small organic molecule
Emp. Form.:
C24H22N6O4
Mol. Mass.:
458.4693
SMILES:
CCn1c2nc(Cc3cn4ccccc4n3)n(Cc3ccc(CC(O)=O)cc3)c2c(=O)[nH]c1=O
: