Target
Tryptophan 5-hydroxylase 1
Ligand
BDBM445696
Substrate
Meas. Tech.
In Vitro Enzyme Activity Assay
IC50
69.0±15 nM
Citation
 Bader, MSpecker, EMatthes, SSchütz, AMallow, KGrohmann, MNazaré, M Xanthine derivatives, their use as a medicament, and pharmaceutical preparations comprising the same US Patent  US11028104 Publication Date 6/8/2021 
Target
Name:
Tryptophan 5-hydroxylase 1
Synonyms:
TPH TPH1_HUMAN TRPH | Tryptophan 5-monooxygenase 1
Type:
PROTEIN
Mol. Mass.:
50990.64
Organism:
Homo sapiens (Human)
Description:
ChEMBL_1361824
Residue:
444
  
Inhibitor
Name:
BDBM445696
Synonyms:
Ex. 32/KM-06-153/(I-32) US11028104, Example 32
Type:
Small organic molecule
Emp. Form.:
C25H25N7O3S
Mol. Mass.:
503.576
SMILES:
CCn1c2nc(Cc3cn4cc(C)sc4n3)n(Cc3ccc(cc3)N3CCCC3=O)c2c(=O)[nH]c1=O
: