Target
Tryptophan 5-hydroxylase 2
Ligand
BDBM445685
Substrate
Meas. Tech.
In Vitro Enzyme Activity Assay
IC50
15.0±4 nM
Citation
 Bader, MSpecker, EMatthes, SSchütz, AMallow, KGrohmann, MNazaré, M Xanthine derivatives, their use as a medicament, and pharmaceutical preparations comprising the same US Patent  US11028104 Publication Date 6/8/2021 
Target
Name:
Tryptophan 5-hydroxylase 2
Synonyms:
NTPH TPH2_HUMAN
Type:
PROTEIN
Mol. Mass.:
56055.12
Organism:
Homo sapiens (Human)
Description:
ChEMBL_487490
Residue:
490
  
Inhibitor
Name:
BDBM445685
Synonyms:
Ex. 21/KM-06-108/(I-21) US11028104, Example 21
Type:
Small organic molecule
Emp. Form.:
C20H17ClN6O2S
Mol. Mass.:
440.906
SMILES:
CCn1c2nc(Cc3cn4cc(Cl)sc4n3)n(Cc3ccccc3)c2c(=O)[nH]c1=O
: