Target
Tryptophan 5-hydroxylase 2
Ligand
BDBM445692
Substrate
Meas. Tech.
In Vitro Enzyme Activity Assay
IC50
17.0±2 nM
Citation
 Bader, MSpecker, EMatthes, SSchütz, AMallow, KGrohmann, MNazaré, M Xanthine derivatives, their use as a medicament, and pharmaceutical preparations comprising the same US Patent  US11028104 Publication Date 6/8/2021 
Target
Name:
Tryptophan 5-hydroxylase 2
Synonyms:
NTPH TPH2_HUMAN
Type:
PROTEIN
Mol. Mass.:
56055.12
Organism:
Homo sapiens (Human)
Description:
ChEMBL_487490
Residue:
490
  
Inhibitor
Name:
BDBM445692
Synonyms:
Ex. 28/KM-06-148/(I-28) US11028104, Example 28
Type:
Small organic molecule
Emp. Form.:
C22H20ClN7O3S
Mol. Mass.:
497.957
SMILES:
CCn1c2nc(Cc3cn4cc(Cl)sc4n3)n(Cc3ccc(NC(C)=O)cc3)c2c(=O)[nH]c1=O
: