Target
Tryptophan 5-hydroxylase 2
Ligand
BDBM445700
Substrate
Meas. Tech.
In Vitro Enzyme Activity Assay
IC50
30.0±4 nM
Citation
 Bader, MSpecker, EMatthes, SSchütz, AMallow, KGrohmann, MNazaré, M Xanthine derivatives, their use as a medicament, and pharmaceutical preparations comprising the same US Patent  US11028104 Publication Date 6/8/2021 
Target
Name:
Tryptophan 5-hydroxylase 2
Synonyms:
NTPH TPH2_HUMAN
Type:
PROTEIN
Mol. Mass.:
56055.12
Organism:
Homo sapiens (Human)
Description:
ChEMBL_487490
Residue:
490
  
Inhibitor
Name:
BDBM445700
Synonyms:
Ex. 36/KM-06-164/(I-36) US11028104, Example 36
Type:
Small organic molecule
Emp. Form.:
C26H29N7O3
Mol. Mass.:
487.5536
SMILES:
CCn1c2nc(Cc3cn4CCCCc4n3)n(Cc3ccc(cc3)N3CCCC3=O)c2c(=O)[nH]c1=O
: