Target
Tryptophan 5-hydroxylase 2
Ligand
BDBM445702
Substrate
Meas. Tech.
In Vitro Enzyme Activity Assay
IC50
35.0±4 nM
Citation
 Bader, MSpecker, EMatthes, SSchütz, AMallow, KGrohmann, MNazaré, M Xanthine derivatives, their use as a medicament, and pharmaceutical preparations comprising the same US Patent  US11028104 Publication Date 6/8/2021 
Target
Name:
Tryptophan 5-hydroxylase 2
Synonyms:
NTPH TPH2_HUMAN
Type:
PROTEIN
Mol. Mass.:
56055.12
Organism:
Homo sapiens (Human)
Description:
ChEMBL_487490
Residue:
490
  
Inhibitor
Name:
BDBM445702
Synonyms:
Ex. 38/KM-06-176/(I-38) US11028104, Example 38
Type:
Small organic molecule
Emp. Form.:
C26H31N7O3
Mol. Mass.:
489.5694
SMILES:
CCn1c2nc(Cc3cn4CCCCc4n3)n(Cc3ccc(cc3)N3CC(C3)OC)c2c(=O)[nH]c1=O
: