Target
Muscarinic acetylcholine receptor M4
Ligand
BDBM502764
Substrate
Meas. Tech.
Binding Assay
Ki
<10±n/a nM
Citation
 Harriott, NPagano, N Compounds of formulas (VII), (VIII), (IX), (XI), (XII), (XIII), and (XIV) as muscarinic receptor 4(M4) antagonists for treating neurological diseases US Patent  US11033539 Publication Date 6/15/2021 
Target
Name:
Muscarinic acetylcholine receptor M4
Synonyms:
ACM4_HUMAN Cholinergic, muscarinic M4 Muscarinic acetylcholine receptor M2 and M4
Type:
Enzyme Catalytic Domain
Mol. Mass.:
53079.31
Organism:
Homo sapiens (Human)
Description:
Cholinergic, muscarinic M4 CHRM4 HUMAN M3::P08173
Residue:
479
  
Inhibitor
Name:
BDBM502764
Synonyms:
(2S)-N-[2-(1-benzylpiperidin-4-yl)ethyl]-4-[3-fluoro-4- (trifluoromethoxy)phenyl]-2-methylpiperazine-1-carboxamide | US11033539, Cpd. No. 4-53
Type:
Small organic molecule
Emp. Form.:
C27H34F4N4O2
Mol. Mass.:
522.5781
SMILES:
C[C@H]1CN(CCN1C(=O)NCCC1CCN(Cc2ccccc2)CC1)c1ccc(OC(F)(F)F)c(F)c1
: