Target
Muscarinic acetylcholine receptor M4
Ligand
BDBM502799
Substrate
Meas. Tech.
Binding Assay
Ki
<10±n/a nM
Citation
 Harriott, NPagano, N Compounds of formulas (VII), (VIII), (IX), (XI), (XII), (XIII), and (XIV) as muscarinic receptor 4(M4) antagonists for treating neurological diseases US Patent  US11033539 Publication Date 6/15/2021 
Target
Name:
Muscarinic acetylcholine receptor M4
Synonyms:
ACM4_HUMAN Cholinergic, muscarinic M4 Muscarinic acetylcholine receptor M2 and M4
Type:
Enzyme Catalytic Domain
Mol. Mass.:
53079.31
Organism:
Homo sapiens (Human)
Description:
Cholinergic, muscarinic M4 CHRM4 HUMAN M3::P08173
Residue:
479
  
Inhibitor
Name:
BDBM502799
Synonyms:
(2R)-N-[2-(1-benzylpiperidin-4-yl)ethyl]-2-methyl-4-[4- (trifluoromethyl)pyrimidin-2-yl]piperazine-1-carboxamide | US11033539, Cpd. No. 5-8
Type:
Small organic molecule
Emp. Form.:
C25H33F3N6O
Mol. Mass.:
490.5643
SMILES:
C[C@@H]1CN(CCN1C(=O)NCCC1CCN(Cc2ccccc2)CC1)c1nccc(n1)C(F)(F)F
: