Target
Tyrosine-protein phosphatase non-receptor type 11
Ligand
BDBM503313
Substrate
Meas. Tech.
Biochemical Assay
IC50
1600±n/a nM
Citation
 Jorand-LeBrun, CBoivin, RMochalkin, IJohnson, TLinde, NMusch, DKumar, D Carboxamide-pyrimidine derivatives as SHP2 antagonists US Patent  US11033547 Publication Date 6/15/2021 
Target
Name:
Tyrosine-protein phosphatase non-receptor type 11
Synonyms:
PTN11_HUMAN PTP-2C PTPN11 Protein tyrosine phosphatase (PTP) Shp2 Protein-tyrosine phosphatase 2C SHP2 Src homology phosphatase 2 (SHP-2) Tyrosine-protein phosphatase non-receptor type 11 (PTPN11) Tyrosine-protein phosphatase non-receptor type 11 (SHP2)
Type:
Protein phosphatase
Mol. Mass.:
68443.59
Organism:
Homo sapiens (Human)
Description:
Q06124
Residue:
597
  
Inhibitor
Name:
BDBM503313
Synonyms:
6-amino-2-[3-(aminomethyl)-8- azabicyclo[3.2.1]octan-8-yl]-5-(2,3- dichlorophenyl)-pyrimidine-4- carboxamide US11696916, Compound 12
Type:
Small organic molecule
Emp. Form.:
C19H22Cl2N6O
Mol. Mass.:
421.324
SMILES:
NCC1CC2CCC(C1)N2c1nc(N)c(-c2cccc(Cl)c2Cl)c(n1)C(N)=O
: