Target
Tyrosine-protein phosphatase non-receptor type 11
Ligand
BDBM503315
Substrate
Meas. Tech.
Biochemical Assay
IC50
8800±n/a nM
Citation
 Jorand-LeBrun, CBoivin, RMochalkin, IJohnson, TLinde, NMusch, DKumar, D Carboxamide-pyrimidine derivatives as SHP2 antagonists US Patent  US11033547 Publication Date 6/15/2021 
Target
Name:
Tyrosine-protein phosphatase non-receptor type 11
Synonyms:
PTN11_HUMAN PTP-2C PTPN11 Protein tyrosine phosphatase (PTP) Shp2 Protein-tyrosine phosphatase 2C SHP2 Src homology phosphatase 2 (SHP-2) Tyrosine-protein phosphatase non-receptor type 11 (PTPN11) Tyrosine-protein phosphatase non-receptor type 11 (SHP2)
Type:
Protein phosphatase
Mol. Mass.:
68443.59
Organism:
Homo sapiens (Human)
Description:
Q06124
Residue:
597
  
Inhibitor
Name:
BDBM503315
Synonyms:
6-amino-5-(2,3-dichlorophenyl)-2- [(1R,7S,11r)-11-amino-1,7- dimethyl-9-azabicyclo[5.3.1]- undecan-9-yl]pyrimidine-4- carboxamide US11696916, Compound 14
Type:
Small organic molecule
Emp. Form.:
C23H30Cl2N6O
Mol. Mass.:
477.43
SMILES:
C[C@@]12CN(C[C@@](C)(CCCCC1)[C@@H]2N)c1nc(N)c(-c2cccc(Cl)c2Cl)c(n1)C(N)=O
: