Target
Tyrosine-protein phosphatase non-receptor type 11
Ligand
BDBM503326
Substrate
Meas. Tech.
Biochemical Assay
IC50
82.0±n/a nM
Citation
 Jorand-LeBrun, CBoivin, RMochalkin, IJohnson, TLinde, NMusch, DKumar, D Carboxamide-pyrimidine derivatives as SHP2 antagonists US Patent  US11033547 Publication Date 6/15/2021 
Target
Name:
Tyrosine-protein phosphatase non-receptor type 11
Synonyms:
PTN11_HUMAN PTP-2C PTPN11 Protein tyrosine phosphatase (PTP) Shp2 Protein-tyrosine phosphatase 2C SHP2 Src homology phosphatase 2 (SHP-2) Tyrosine-protein phosphatase non-receptor type 11 (PTPN11) Tyrosine-protein phosphatase non-receptor type 11 (SHP2)
Type:
Protein phosphatase
Mol. Mass.:
68443.59
Organism:
Homo sapiens (Human)
Description:
Q06124
Residue:
597
  
Inhibitor
Name:
BDBM503326
Synonyms:
(4M)-6-amino-2-(4-amino-4- methylpiperidin-1-yl)-5-(2,3- dichlorophenyl)pyrimidine-4- carboxamide US11033547, Compound 27 | US11696916, Compound 27
Type:
Small organic molecule
Emp. Form.:
C17H20Cl2N6O
Mol. Mass.:
395.286
SMILES:
CC1(N)CCN(CC1)c1nc(N)c(c(n1)C(N)=O)-c1cccc(Cl)c1Cl
: