Target
Tyrosine-protein phosphatase non-receptor type 11
Ligand
BDBM503329
Substrate
Meas. Tech.
Biochemical Assay
IC50
260±n/a nM
Citation
 Jorand-LeBrun, CBoivin, RMochalkin, IJohnson, TLinde, NMusch, DKumar, D Carboxamide-pyrimidine derivatives as SHP2 antagonists US Patent  US11033547 Publication Date 6/15/2021 
Target
Name:
Tyrosine-protein phosphatase non-receptor type 11
Synonyms:
PTN11_HUMAN PTP-2C PTPN11 Protein tyrosine phosphatase (PTP) Shp2 Protein-tyrosine phosphatase 2C SHP2 Src homology phosphatase 2 (SHP-2) Tyrosine-protein phosphatase non-receptor type 11 (PTPN11) Tyrosine-protein phosphatase non-receptor type 11 (SHP2)
Type:
Protein phosphatase
Mol. Mass.:
68443.59
Organism:
Homo sapiens (Human)
Description:
Q06124
Residue:
597
  
Inhibitor
Name:
BDBM503329
Synonyms:
6-amino-2-[4-amino-4- (hydroxymethyl)piperidin-1-yl]-5- (2,3-dichlorophenyl)-pyrimidine-4- carboxamide US11696916, Compound 29
Type:
Small organic molecule
Emp. Form.:
C17H20Cl2N6O2
Mol. Mass.:
411.286
SMILES:
NC(=O)c1nc(nc(N)c1-c1cccc(Cl)c1Cl)N1CCC(N)(CO)CC1
: