Target
Tyrosine-protein phosphatase non-receptor type 11
Ligand
BDBM503338
Substrate
Meas. Tech.
Biochemical Assay
IC50
7600±n/a nM
Citation
 Jorand-LeBrun, CBoivin, RMochalkin, IJohnson, TLinde, NMusch, DKumar, D Carboxamide-pyrimidine derivatives as SHP2 antagonists US Patent  US11033547 Publication Date 6/15/2021 
Target
Name:
Tyrosine-protein phosphatase non-receptor type 11
Synonyms:
PTN11_HUMAN PTP-2C PTPN11 Protein tyrosine phosphatase (PTP) Shp2 Protein-tyrosine phosphatase 2C SHP2 Src homology phosphatase 2 (SHP-2) Tyrosine-protein phosphatase non-receptor type 11 (PTPN11) Tyrosine-protein phosphatase non-receptor type 11 (SHP2)
Type:
Protein phosphatase
Mol. Mass.:
68443.59
Organism:
Homo sapiens (Human)
Description:
Q06124
Residue:
597
  
Inhibitor
Name:
BDBM503338
Synonyms:
6-amino-2-{4-amino-1-oxa-9- azaspiro[5.5]undecan-9-yl}-5-(2,3- dichlorophenyl)pyrimidine-4- carboxamide US11696916, Compound 38
Type:
Small organic molecule
Emp. Form.:
C20H24Cl2N6O2
Mol. Mass.:
451.35
SMILES:
NC1CCOC2(CCN(CC2)c2nc(N)c(-c3cccc(Cl)c3Cl)c(n2)C(N)=O)C1
: