Target
Tyrosine-protein phosphatase non-receptor type 11
Ligand
BDBM503360
Substrate
Meas. Tech.
Biochemical Assay
IC50
>10000±n/a nM
Citation
 Jorand-LeBrun, CBoivin, RMochalkin, IJohnson, TLinde, NMusch, DKumar, D Carboxamide-pyrimidine derivatives as SHP2 antagonists US Patent  US11033547 Publication Date 6/15/2021 
Target
Name:
Tyrosine-protein phosphatase non-receptor type 11
Synonyms:
PTN11_HUMAN PTP-2C PTPN11 Protein tyrosine phosphatase (PTP) Shp2 Protein-tyrosine phosphatase 2C SHP2 Src homology phosphatase 2 (SHP-2) Tyrosine-protein phosphatase non-receptor type 11 (PTPN11) Tyrosine-protein phosphatase non-receptor type 11 (SHP2)
Type:
Protein phosphatase
Mol. Mass.:
68443.59
Organism:
Homo sapiens (Human)
Description:
Q06124
Residue:
597
  
Inhibitor
Name:
BDBM503360
Synonyms:
2-(4-Amino-4-methyl-piperidin-1- yl)-5-benzo[1,2,5]-oxadiazol-4-yl- pyrimidine-4-carboxylic acid amide US11696916, Compound 61
Type:
Small organic molecule
Emp. Form.:
C17H19N7O2
Mol. Mass.:
353.3785
SMILES:
CC1(N)CCN(CC1)c1ncc(-c2cccc3nonc23)c(n1)C(N)=O
: