Target
Tyrosine-protein phosphatase non-receptor type 11
Ligand
BDBM503368
Substrate
Meas. Tech.
Biochemical Assay
IC50
5300±n/a nM
Citation
 Jorand-LeBrun, CBoivin, RMochalkin, IJohnson, TLinde, NMusch, DKumar, D Carboxamide-pyrimidine derivatives as SHP2 antagonists US Patent  US11033547 Publication Date 6/15/2021 
Target
Name:
Tyrosine-protein phosphatase non-receptor type 11
Synonyms:
PTN11_HUMAN PTP-2C PTPN11 Protein tyrosine phosphatase (PTP) Shp2 Protein-tyrosine phosphatase 2C SHP2 Src homology phosphatase 2 (SHP-2) Tyrosine-protein phosphatase non-receptor type 11 (PTPN11) Tyrosine-protein phosphatase non-receptor type 11 (SHP2)
Type:
Protein phosphatase
Mol. Mass.:
68443.59
Organism:
Homo sapiens (Human)
Description:
Q06124
Residue:
597
  
Inhibitor
Name:
BDBM503368
Synonyms:
6-amino-2-[(1R,5S,6R)-6- (aminomethyI)-3-azabicyclo- [3.1.0]hexan-3-yl]-5-(2,3- dichlorophenyl)pyrimidine-4- carboxamide US11696916, Compound 70
Type:
Small organic molecule
Emp. Form.:
C17H18Cl2N6O
Mol. Mass.:
393.27
SMILES:
NC[C@H]1[C@@H]2CN(C[C@H]12)c1nc(N)c(-c2cccc(Cl)c2Cl)c(n1)C(N)=O
: