Target
Tyrosine-protein phosphatase non-receptor type 11
Ligand
BDBM503409
Substrate
Meas. Tech.
Biochemical Assay
IC50
66.0±n/a nM
Citation
 Jorand-LeBrun, CBoivin, RMochalkin, IJohnson, TLinde, NMusch, DKumar, D Carboxamide-pyrimidine derivatives as SHP2 antagonists US Patent  US11033547 Publication Date 6/15/2021 
Target
Name:
Tyrosine-protein phosphatase non-receptor type 11
Synonyms:
PTN11_HUMAN PTP-2C PTPN11 Protein tyrosine phosphatase (PTP) Shp2 Protein-tyrosine phosphatase 2C SHP2 Src homology phosphatase 2 (SHP-2) Tyrosine-protein phosphatase non-receptor type 11 (PTPN11) Tyrosine-protein phosphatase non-receptor type 11 (SHP2)
Type:
Protein phosphatase
Mol. Mass.:
68443.59
Organism:
Homo sapiens (Human)
Description:
Q06124
Residue:
597
  
Inhibitor
Name:
BDBM503409
Synonyms:
6-Amino-2-[(4-amino-cyclohexyl)- methyl-amino]-5-(2,3-dichloro- phenyl)-pyrimidine-4-carboxylic acid amide US11696916, Compound 112
Type:
Small organic molecule
Emp. Form.:
C18H22Cl2N6O
Mol. Mass.:
409.313
SMILES:
CN([C@H]1CC[C@H](N)CC1)c1nc(N)c(-c2cccc(Cl)c2Cl)c(n1)C(N)=O
: