Target
Tyrosine-protein phosphatase non-receptor type 11
Ligand
BDBM503416
Substrate
Meas. Tech.
Biochemical Assay
IC50
6.00±n/a nM
Citation
 Jorand-LeBrun, CBoivin, RMochalkin, IJohnson, TLinde, NMusch, DKumar, D Carboxamide-pyrimidine derivatives as SHP2 antagonists US Patent  US11033547 Publication Date 6/15/2021 
Target
Name:
Tyrosine-protein phosphatase non-receptor type 11
Synonyms:
PTN11_HUMAN PTP-2C PTPN11 Protein tyrosine phosphatase (PTP) Shp2 Protein-tyrosine phosphatase 2C SHP2 Src homology phosphatase 2 (SHP-2) Tyrosine-protein phosphatase non-receptor type 11 (PTPN11) Tyrosine-protein phosphatase non-receptor type 11 (SHP2)
Type:
Protein phosphatase
Mol. Mass.:
68443.59
Organism:
Homo sapiens (Human)
Description:
Q06124
Residue:
597
  
Inhibitor
Name:
BDBM503416
Synonyms:
(5M)-2-[(1S)-1-amino-1,3- dihydrospiro[indene-2,4''-piperidin]-1''- yl]-5-(2,3-dichlorophenyl)-6- methylpyrimidine-4-carboxamide US11033547, Compound 120 US11033547, Compound 122 US11033547, Compound 124 US11033547, Compound 126 US11033547, Compound 128 US11033547, Compound 130 US11696916, Compound 131
Type:
Small organic molecule
Emp. Form.:
C22H21Cl2N7O2
Mol. Mass.:
486.354
SMILES:
N[C@H]1c2cccnc2OC11CCN(CC1)c1nc(N)c(-c2cccc(Cl)c2Cl)c(n1)C(N)=O
: