Target
Nuclear receptor ROR-gamma
Ligand
BDBM503458
Substrate
Meas. Tech.
Fluorescence Based Assay
Kd
10.00±n/a nM
Citation
 Goldberg, SMartin, CLFennema, EGWolin, RLFourie, AMXue, X Pyridinyl pyrazoles as modulators of RORγT US Patent  US11034658 Publication Date 6/15/2021 
Target
Name:
Nuclear receptor ROR-gamma
Synonyms:
NR1F3 Nuclear receptor ROR-gamma (RORC) RAR-related orphan receptor C (RORc) RORG RZRG Retinoid-related orphan receptor-gamma (RORc)
Type:
Enzyme Catalytic Domain
Mol. Mass.:
58218.40
Organism:
Homo sapiens (Human)
Description:
P51449
Residue:
518
  
Inhibitor
Name:
BDBM503458
Synonyms:
4-Chloro-5-(4-(difluoromethoxy)-6-(3,3,3-trifluoro-2,2-dimethylpropyl)pyridin-3-yl)-1-methyl-N-(((1r,4r)-4-(methylsulfonyl)cyclohexyl)methyl)-1H-pyrazole-3-carboxamide | US11034658, Example 30
Type:
Small organic molecule
Emp. Form.:
C24H30ClF5N4O2
Mol. Mass.:
536.966
SMILES:
C[C@H]1CC[C@H](CNC(=O)c2nn(C)c(c2Cl)-c2cnc(CC(C)(C)C(F)(F)F)cc2OC(F)F)CC1
: