Target
Nuclear receptor ROR-gamma
Ligand
BDBM503464
Substrate
Meas. Tech.
Fluorescence Based Assay
Kd
20.0±n/a nM
Citation
 Goldberg, SMartin, CLFennema, EGWolin, RLFourie, AMXue, X Pyridinyl pyrazoles as modulators of RORγT US Patent  US11034658 Publication Date 6/15/2021 
Target
Name:
Nuclear receptor ROR-gamma
Synonyms:
NR1F3 Nuclear receptor ROR-gamma (RORC) RAR-related orphan receptor C (RORc) RORG RZRG Retinoid-related orphan receptor-gamma (RORc)
Type:
Enzyme Catalytic Domain
Mol. Mass.:
58218.40
Organism:
Homo sapiens (Human)
Description:
P51449
Residue:
518
  
Inhibitor
Name:
BDBM503464
Synonyms:
4-Chloro-1-ethyl-N-(((1s,4s)-1-hydroxy-4-(methylsulfonyl)cyclohexyl)methyl)-5-(4-methoxy-6-(3,3,3-trifluoro-2,2-dimethylpropoxy)pyridin-3-yl)-1H-pyrazole-3-carboxamide | US11034658, Example 36
Type:
Small organic molecule
Emp. Form.:
C26H36ClF3N4O3
Mol. Mass.:
545.037
SMILES:
CCn1nc(C(=O)NC[C@@]2(O)CC[C@H](C)CC2)c(Cl)c1-c1cnc(CCC(C)(C)C(F)(F)F)cc1OC
: