Target
Nuclear receptor ROR-gamma
Ligand
BDBM503473
Substrate
Meas. Tech.
Fluorescence Based Assay
Kd
0.350±n/a nM
Citation
 Goldberg, SMartin, CLFennema, EGWolin, RLFourie, AMXue, X Pyridinyl pyrazoles as modulators of RORγT US Patent  US11034658 Publication Date 6/15/2021 
Target
Name:
Nuclear receptor ROR-gamma
Synonyms:
NR1F3 Nuclear receptor ROR-gamma (RORC) RAR-related orphan receptor C (RORc) RORG RZRG Retinoid-related orphan receptor-gamma (RORc)
Type:
Enzyme Catalytic Domain
Mol. Mass.:
58218.40
Organism:
Homo sapiens (Human)
Description:
P51449
Residue:
518
  
Inhibitor
Name:
BDBM503473
Synonyms:
4-Chloro-5-(2-(difluoromethoxy)-6-(3,3,3-trifluoro-2,2-dimethylpropyl)pyridin-3-yl)-1-ethyl-N-(((1r,4r)-4-(methylsulfonyl)cyclohexyl)methyl)-1H-pyrazole-3-carboxamide | US11034658, Example 45
Type:
Small organic molecule
Emp. Form.:
C25H32ClF5N4O2
Mol. Mass.:
550.992
SMILES:
CCn1nc(C(=O)NC[C@H]2CC[C@H](C)CC2)c(Cl)c1-c1ccc(CC(C)(C)C(F)(F)F)nc1OC(F)F
: