Target
Indoleamine 2,3-dioxygenase 1
Ligand
BDBM503521
Substrate
Meas. Tech.
Enzyme Assay
IC50
396±n/a nM
Citation
 Guo, LHan, YLiu, KHe, SKozlowski, JNargund, RYu, WZhang, HPu, QLi, DAchab, ALi, G Substituted N′-hydroxycarbamimidoyl-1,2,5-oxadiazole compounds as indoleamine 2,3-dioxygenase IDO inhibitors US Patent  US11034661 Publication Date 6/15/2021 
Target
Name:
Indoleamine 2,3-dioxygenase 1
Synonyms:
I23O1_HUMAN IDO-1 INDO Indoleamine 2,3-dioxygenase | Indoleamine-pyrrole 2,3-dioxygenase
Type:
Enzyme
Mol. Mass.:
45330.80
Organism:
Homo sapiens (Human)
Description:
P14902
Residue:
403
  
Inhibitor
Name:
BDBM503521
Synonyms:
N-[(7S)-4-fluorobicyclo[4.2.0]octa- 1,3,5-trien-7-yl]-N'-hydroxy-4-[2- (4H-1,2,4-triazol-4-yl)ethoxy]-1,2,5- oxadiazole-3-carboximidamide | US11034661, Example 28
Type:
Small organic molecule
Emp. Form.:
C15H14FN7O3
Mol. Mass.:
359.3152
SMILES:
O\N=C(/N[C@H]1Cc2ccc(F)cc12)c1nonc1OCCn1cnnc1
: