Target
Indoleamine 2,3-dioxygenase 1
Ligand
BDBM503554
Substrate
Meas. Tech.
Enzyme Assay
IC50
89.0±n/a nM
Citation
 Guo, LHan, YLiu, KHe, SKozlowski, JNargund, RYu, WZhang, HPu, QLi, DAchab, ALi, G Substituted N′-hydroxycarbamimidoyl-1,2,5-oxadiazole compounds as indoleamine 2,3-dioxygenase IDO inhibitors US Patent  US11034661 Publication Date 6/15/2021 
Target
Name:
Indoleamine 2,3-dioxygenase 1
Synonyms:
I23O1_HUMAN IDO-1 INDO Indoleamine 2,3-dioxygenase | Indoleamine-pyrrole 2,3-dioxygenase
Type:
Enzyme
Mol. Mass.:
45330.80
Organism:
Homo sapiens (Human)
Description:
P14902
Residue:
403
  
Inhibitor
Name:
BDBM503554
Synonyms:
N-((S)-4-fluorobicyclo[4.2.0]octa- 1(6),2,4-trien- 7-yl)-N'-hydroxy-4-((1-((R)-2- hydroxypropanoyl)azetidin- 3-yl)oxy)-1,2,5- oxadiazole-3-carboximidamide | US11034661, Example 61
Type:
Small organic molecule
Emp. Form.:
C17H18FN5O5
Mol. Mass.:
391.3537
SMILES:
C[C@@H](O)C(=O)N1CC(C1)Oc1nonc1\C(N[C@H]1Cc2ccc(F)cc12)=N\O
: