Target
Poly [ADP-ribose] polymerase 1
Ligand
BDBM503577
Substrate
Meas. Tech.
Scintillation Proximity Assay
IC50
8.00±n/a nM
Citation
 Takahashi, TKluge, ALagu, BJi, N Poly-ADP ribose polymerase (PARP) inhibitors US Patent  US11034670 Publication Date 6/15/2021 
Target
Name:
Poly [ADP-ribose] polymerase 1
Synonyms:
(ARTD1 or PARP1) 2.4.2.30 ADPRT ARTD1 Human diphtheria toxin-like ADP-ribosyltransferase (ARTD1 or PARP1) NT-PARP-1 PARP1 PPOL Poly [ADP-ribose] polymerase 1 (PARP) Poly [ADP-ribose] polymerase 1 (PARP1) Poly [ADP-ribose] polymerase 1, 28-kDa form Poly [ADP-ribose] polymerase 1, processed C-terminus Poly [ADP-ribose] polymerase-1 Poly(ADP-ribose) polymerase-1 (ARTD1/PARP1) Protein poly-ADP-ribosyltransferase PARP1 | Synonyms=ADPRT
Type:
Mol. Mass.:
113114.22
Organism:
Homo sapiens (Human)
Description:
P09874
Residue:
1014
  
Inhibitor
Name:
BDBM503577
Synonyms:
6-[4-[3-(5-fluoro-4-oxo-3H-quinazolin-2-yl)propanoyl]piperazin-1-yl]pyridine-3-carbonitrile | US11034670, Ex. 17
Type:
Small organic molecule
Emp. Form.:
C21H19FN6O2
Mol. Mass.:
406.413
SMILES:
Fc1cccc2nc(CCC(=O)N3CCN(CC3)c3ccc(cn3)C#N)[nH]c(=O)c12
: