Target
Poly [ADP-ribose] polymerase 2
Ligand
BDBM503590
Substrate
Meas. Tech.
Scintillation Proximity Assay
IC50
624±n/a nM
Citation
 Takahashi, TKluge, ALagu, BJi, N Poly-ADP ribose polymerase (PARP) inhibitors US Patent  US11034670 Publication Date 6/15/2021 
Target
Name:
Poly [ADP-ribose] polymerase 2
Synonyms:
(ARTD2 or PARP2) ADPRTL2 PARP2_HUMAN Poly [ADP-ribose] polymerase 2 (PARP2)
Type:
Enzyme
Mol. Mass.:
66225.70
Organism:
Homo sapiens (Human)
Description:
Q9UGN5
Residue:
583
  
Inhibitor
Name:
BDBM503590
Synonyms:
US11034670, Ex. 30
Type:
Small organic molecule
Emp. Form.:
C22H21FN6O2
Mol. Mass.:
420.4395
SMILES:
C[C@H]1CN(CCN1C(=O)CCc1nc2cccc(F)c2c(=O)[nH]1)c1ccc(cn1)C#N
: