Target
Poly [ADP-ribose] polymerase 2
Ligand
BDBM503612
Substrate
Meas. Tech.
Scintillation Proximity Assay
IC50
999±n/a nM
Citation
 Takahashi, TKluge, ALagu, BJi, N Poly-ADP ribose polymerase (PARP) inhibitors US Patent  US11034670 Publication Date 6/15/2021 
Target
Name:
Poly [ADP-ribose] polymerase 2
Synonyms:
(ARTD2 or PARP2) ADPRTL2 PARP2_HUMAN Poly [ADP-ribose] polymerase 2 (PARP2)
Type:
Enzyme
Mol. Mass.:
66225.70
Organism:
Homo sapiens (Human)
Description:
Q9UGN5
Residue:
583
  
Inhibitor
Name:
BDBM503612
Synonyms:
2-(3-(4-(4-fluorophenyl)piperazin-1-yl)-3-oxopropyl)quinazolin-4 (3H)-one | US11034670, Ex. 52
Type:
Small organic molecule
Emp. Form.:
C21H21FN4O2
Mol. Mass.:
380.4154
SMILES:
Fc1ccc(cc1)N1CCN(CC1)C(=O)CCc1nc2ccccc2c(=O)[nH]1
: