Target
Poly [ADP-ribose] polymerase 1
Ligand
BDBM503613
Substrate
Meas. Tech.
Scintillation Proximity Assay
IC50
189±n/a nM
Citation
 Takahashi, TKluge, ALagu, BJi, N Poly-ADP ribose polymerase (PARP) inhibitors US Patent  US11034670 Publication Date 6/15/2021 
Target
Name:
Poly [ADP-ribose] polymerase 1
Synonyms:
(ARTD1 or PARP1) 2.4.2.30 ADPRT ARTD1 Human diphtheria toxin-like ADP-ribosyltransferase (ARTD1 or PARP1) NT-PARP-1 PARP1 PPOL Poly [ADP-ribose] polymerase 1 (PARP) Poly [ADP-ribose] polymerase 1 (PARP1) Poly [ADP-ribose] polymerase 1, 28-kDa form Poly [ADP-ribose] polymerase 1, processed C-terminus Poly [ADP-ribose] polymerase-1 Poly(ADP-ribose) polymerase-1 (ARTD1/PARP1) Protein poly-ADP-ribosyltransferase PARP1 | Synonyms=ADPRT
Type:
Mol. Mass.:
113114.22
Organism:
Homo sapiens (Human)
Description:
P09874
Residue:
1014
  
Inhibitor
Name:
BDBM503613
Synonyms:
2-(3-(4-(4-fluorophenyl)-3,6-dihydropyridin-1 (2H)-yl)-3-oxopropyl)-7-methyl-3,7-dihydro-4H-pyrrolo[2,3-d]pyrimidin-4-one | US11034670, Ex. 53
Type:
Small organic molecule
Emp. Form.:
C21H21FN4O2
Mol. Mass.:
380.4154
SMILES:
Cn1ccc2c1nc(CCC(=O)N1CCC(=CC1)c1ccc(F)cc1)[nH]c2=O
: