Target
Mitogen-activated protein kinase kinase kinase 5
Ligand
BDBM503622
Substrate
Meas. Tech.
Biochemical Assay
Kd
750±n/a nM
Citation
 Jin, BDong, QHung, G Apoptosis signal-regulating kinase inhibitors and uses thereof US Patent  US11034671 Publication Date 6/15/2021 
Target
Name:
Mitogen-activated protein kinase kinase kinase 5
Synonyms:
ASK1 MAP3K5 MEKK5
Type:
Protein
Mol. Mass.:
154514.93
Organism:
Homo sapiens (Human)
Description:
Q99683
Residue:
1374
  
Inhibitor
Name:
BDBM503622
Synonyms:
US11034671, Example 9
Type:
Small organic molecule
Emp. Form.:
C28H28N6O2
Mol. Mass.:
480.5609
SMILES:
O=C1Nc2cccc(n2)-c2nncn2CCCCCCOc2ccc(cc12)-c1ccc(nc1)C1CC1
: