Target
Mitogen-activated protein kinase kinase kinase 5
Ligand
BDBM503632
Substrate
Meas. Tech.
Biochemical Assay
Kd
300±n/a nM
Citation
 Jin, BDong, QHung, G Apoptosis signal-regulating kinase inhibitors and uses thereof US Patent  US11034671 Publication Date 6/15/2021 
Target
Name:
Mitogen-activated protein kinase kinase kinase 5
Synonyms:
ASK1 MAP3K5 MEKK5
Type:
Protein
Mol. Mass.:
154514.93
Organism:
Homo sapiens (Human)
Description:
Q99683
Residue:
1374
  
Inhibitor
Name:
BDBM503632
Synonyms:
US11034671, Example 19
Type:
Small organic molecule
Emp. Form.:
C27H26N6O2
Mol. Mass.:
466.5343
SMILES:
O=C1Nc2cccc(n2)-c2nncn2CCCCCOc2ccc(cc12)-c1ccc(nc1)C1CC1
: